BDBM50314205 (S)-1-(3-(3-(2-(4-fluoropiperidin-1-yl)ethylthio)-4-(trifluoromethyl)phenyl)-5-(isopropylsulfonyl)-4,5,6,7-tetrahydro-1H-pyrazolo[4,3-c]pyridin-1-yl)-3-(piperidin-1-yl)propan-2-ol::CHEMBL1089608
SMILES CC(C)S(=O)(=O)N1CCc2c(C1)c(nn2C[C@@H](O)CN1CCCCC1)-c1ccc(c(SCCN2CCC(F)CC2)c1)C(F)(F)F
InChI Key InChIKey=UBGAVECNCYJIIH-VWLOTQADSA-N
Data  1 IC50
  Tab Delimited (TSV)   2D SDfile   Computed 3D by Vconf -m prep SDfile
Find this compound or compounds like it in BindingDB:
Activity Spreadsheet -- Enzyme Inhibition Constant Data from BindingDB
Found 1 hit for monomerid = 50314205
TargetCathepsin S(Homo sapiens (Human))
Johnson & Johnson Pharmaceutical Research & Development
Curated by ChEMBL
LigandPNGBDBM50314205((S)-1-(3-(3-(2-(4-fluoropiperidin-1-yl)ethylthio)-...)
Affinity DataIC50:  350nM. Assay description: Inhibition of human cathepsin S by ADAM-28 substrate-based fluorescence assay
In DepthDetails ArticlePubMed